{"text_format":"2","workbook":"xlsx","n_sheets":14,"sheets":["Intro","Objectives","Strategic","Financial","Operational","Compliance","Reputational","Reporting","Graph","Lists","Scales","Scoring","ForPrint","Export"],"not_rendered":{"charts":1,"images":60,"macros":0,"external_links":0,"defined_names":56,"comments":0,"pivot_tables":0},"unopened":[],"bounds":{"document_bytes":16777216,"sheet_cells":100000,"run_cost":"one","rows_first":2000,"rows_last":500,"rows_between":2000,"halvings":0,"cell_chars":16384,"cell_head_chars":4096},"cells_cut":0,"cells_raw":0,"read":"whole","date_system":"1900"}

{"sheet":"Intro","index":0,"n_rows":46,"n_cols":6,"rows_kept":46,"cut":false,"hidden":false,"merged":[[1,1,2,8],[3,1,3,8],[45,1,46,2],[14,5,14,8],[13,5,13,8],[12,5,12,8],[11,5,11,8],[4,5,8,8],[9,5,9,8],[10,5,10,8],[16,1,44,9]]}
[]
[null,"Program Risk Review Using ERM"]
[]
[null,"Project Information"]
[{"$nulls":4},"Project/Initiative description:","To explore new worlds, to go where no one has gone before."]
[]
{"$rows_left_out":14}
{"sheet":"Objectives","index":1,"n_rows":43,"n_cols":6,"rows_kept":43,"cut":false,"hidden":false,"merged":[[23,4,23,5],[30,4,30,5],[37,4,37,5],[0,1,1,2],[2,4,2,5],[9,4,9,5],[16,4,16,5]]}
[null,"Describe Objectives"]
[]
[{"$nulls":4},"Strategic Objectives"]
[{"$nulls":4},"1.","National and International Leader in in transforming educational experiences."]
[{"$nulls":4},"2.","Recruit a larger and increasingly diverse student body."]
[{"$nulls":4},"3.","Improve graduation success of all students."]
{"$rows_left_out":38}
{"sheet":"Strategic","index":2,"n_rows":20,"n_cols":11,"rows_kept":20,"cut":false,"hidden":false,"merged":[[2,1,22,1]]}
[]
[null,"Assess Strategic Risks"]
[null,"The objectives you entered are shown at right. Below them are spaces to list the risks which could impair accomplishing those objectives. \n\nOnce you have listed the risks, assess the impact and likelihood of each, and describe the risk management and mitigation activities prescribed by management. Next, identify how frequently the controls are implemented and their effectiveness. \n\nThen, under \"Dashboards, Monitoring, & Reporting,\" describe how the control activities are being monitored and identify the person in your organization who is accountable for monitoring those controls.\n\nIf you want to change the options shown on the menus for \"Risk Impact\", \"Risk Likelihood\", or \"Control Effectiveness\" you can change them by clicking \"Customize Scales\" below."]
[]
[null,null,null,"Strategic Risks","Risk Impact","Risk Likelihood","Management and Mitigation","Frequency of Controls","Control Effectiveness","Dashboards, Monitoring, & Reporting","Accountable\nPerson/Department"]
[null,null,null,"Budget impairment","Low","Very High","External financing program; Budget Officers","Semi-annually","Minor","Leveraging Wisdom & WISER systems","Senior leadership, Deans, Administration"]
{"$rows_left_out":15}
{"sheet":"Financial","index":3,"n_rows":16,"n_cols":11,"rows_kept":16,"cut":false,"hidden":false,"merged":[[2,1,19,1]]}
[]
[null,"Assess Financial Risks"]
[null,"The objectives you entered are shown at right. Below them are spaces to list the risks which could impair accomplishing those objectives. \n\nOnce you have listed the risks, assess the impact and likelihood of each, and describe the risk management and mitigation activities prescribed by management. Next, identify how frequently the controls are implemented and their effectiveness. \n\nThen, under \"Dashboards, Monitoring, & Reporting,\" describe how the control activities are being monitored and identify the person in your organization who is accountable for monitoring those controls.\n\nIf you want to change the options shown on the menus for \"Risk Impact\", \"Risk Likelihood\", or \"Control Effectiveness\" you can change them by clicking \"Customize Scales\" below."]
[]
[null,null,null,"Financial Risks","Risk Impact","Risk Likelihood","Management and Mitigation","Frequency of Controls","Control Effectiveness","Dashboards, Monitoring, & Reporting","Accountable\nPerson/Department"]
[null,null,null,"Budget Impairment","Low","Very Low","Budget Officers Meetings; Financial Plan; Conversations with Governor and Legislature","Annually","Significant","Leveraging Wisdom & WISER systems","Campus Budget Offices, Senior leadership"]
{"$rows_left_out":11}
{"sheet":"Operational","index":4,"n_rows":20,"n_cols":11,"rows_kept":20,"cut":false,"hidden":false,"merged":[[2,1,19,1]]}
[]
[null,"Assess Operational Risks"]
[null,"The objectives you entered are shown at right. Below them are spaces to list the risks which could impair accomplishing those objectives. \n\nOnce you have listed the risks, assess the impact and likelihood of each, and describe the risk management and mitigation activities prescribed by management. Next, identify how frequently the controls are implemented and their effectiveness. \n\nThen, under \"Dashboards, Monitoring, & Reporting,\" describe how the control activities are being monitored and identify the person in your organization who is accountable for monitoring those controls.\n\nIf you want to change the options shown on the menus for \"Risk Impact\", \"Risk Likelihood\", or \"Control Effectiveness\" you can change them by clicking \"Customize Scales\" below."]
[]
[null,null,null,"Operational Risks","Risk Impact","Risk Likelihood","Management and Mitigation","Frequency of Controls","Control Effectiveness","Dashboards, Monitoring, & Reporting","Accountable\nPerson/Department"]
[null,null,null,"Catastrophic natural event (tornado, fire, etc.)","Very high","Moderate","Mission continuity; emergency management; Concern re utility systems, lack generator connections to buildings, also risk of flooding, ice and accessibility challenges.","Semi-annually","Moderate","Capital Planning documents; Regular University wide participation drills, documentation thereof.","Risk Management/ARCE"]
{"$rows_left_out":15}
{"sheet":"Compliance","index":5,"n_rows":23,"n_cols":11,"rows_kept":23,"cut":false,"hidden":false,"merged":[[2,1,19,1]]}
[]
[null,"Assess Compliance Risks"]
[null,"The objectives you entered are shown at right. Below them are spaces to list the risks which could impair accomplishing those objectives. \n\nOnce you have listed the risks, assess the impact and likelihood of each, and describe the risk management and mitigation activities prescribed by management. Next, identify how frequently the controls are implemented and their effectiveness. \n\nThen, under \"Dashboards, Monitoring, & Reporting,\" describe how the control activities are being monitored and identify the person in your organization who is accountable for monitoring those controls.\n\nIf you want to change the options shown on the menus for \"Risk Impact\", \"Risk Likelihood\", or \"Control Effectiveness\" you can change them by clicking \"Customize Scales\" below."]
[]
[null,null,null,"Compliance Risks","Risk Impact","Risk Likelihood","Management and Mitigation","Frequency of Controls","Control Effectiveness","Dashboards, Monitoring, & Reporting","Accountable\nPerson/Department"]
[null,null,null,"Conflicts of interest in financial transactions and agreements","Very low","Low","Annual system wide Outside Activities Reporting (OAR)/Conflict of Interest (COI) Reporting for Designated Officials; Business Contract Policies; Whistle Blower system; Employee Handbook (Ch. 8 Code of Ethics)","Annually","Minor","Annual Outside Activities Reporting (OAR)/Conflict of Interest (COI) Reports by Designated Officials; Whistle blower system; Code of Ethics","Administration"]
{"$rows_left_out":18}
{"sheet":"Reputational","index":6,"n_rows":15,"n_cols":11,"rows_kept":15,"cut":false,"hidden":false,"merged":[[2,1,20,1]]}
[]
[null,"Assess Reputational Risks"]
[null,"The objectives you entered are shown at right. Below them are spaces to list the risks which could impair accomplishing those objectives. \n\nOnce you have listed the risks, assess the impact and likelihood of each, and describe the risk management and mitigation activities prescribed by management. Next, identify how frequently the controls are implemented and their effectiveness. \n\nThen, under \"Dashboards, Monitoring, & Reporting,\" describe how the control activities are being monitored and identify the person in your organization who is accountable for monitoring those controls.\n\nIf you want to change the options shown on the menus for \"Risk Impact\", \"Risk Likelihood\", or \"Control Effectiveness\" you can change them by clicking \"Customize Scales\" below."]
[]
[null,null,null,"Reputational Risks","Risk Impact","Risk Likelihood","Management and Mitigation","Frequency of Controls","Control Effectiveness","Dashboards, Monitoring, & Reporting","Accountable\nPerson/Department"]
[null,null,null,"Research misconduct, such as falsification of data or results, or non-disclosure of research dangers","Very low","Moderate","Research Compliance and Integrity Offices; Research Compliance Policies (Certifications and Manuals); ARCE; Internal Control Program; Whistle Blower Program; Mandatory Ethics Training","Weekly","Significant","Whistle blower system; Claims System; Investigations of allegations of research misconduct","Individual Pis"]
{"$rows_left_out":10}
{"sheet":"Reporting","index":7,"n_rows":12,"n_cols":11,"rows_kept":12,"cut":false,"hidden":false,"merged":[[2,1,25,1]]}
[]
[null,"Assess Reporting Risks"]
[null,"The objectives you entered are shown at right. Below them are spaces to list the risks which could impair accomplishing those objectives. \n\nOnce you have listed the risks, assess the impact and likelihood of each, and describe the risk management and mitigation activities prescribed by management. Next, identify how frequently the controls are implemented and their effectiveness. \n\nThen, under \"Dashboards, Monitoring, & Reporting,\" describe how the control activities are being monitored and identify the person in your organization who is accountable for monitoring those controls.\n\nIf you want to change the options shown on the menus for \"Risk Impact\", \"Risk Likelihood\", or \"Control Effectiveness\" you can change them by clicking \"Customize Scales\" below."]
[]
[null,null,null,"Reporting Risks","Risk Impact","Risk Likelihood","Management and Mitigation","Frequency of Controls","Control Effectiveness","Dashboards, Monitoring, & Reporting","Accountable\nPerson/Department"]
[null,null,null,"Failure to maintain equipment inventories","Unsure/Don't know","Very low","Equipment Management Policies; Internal Audit Review ","Weekly","Nearly complete","Maintenance Insurance Program; looking to deploy the included equipment inventory database system-wide; Periodic physical inventories and certifications of equipment","Individual Pis"]
{"$rows_left_out":7}
{"sheet":"Graph","index":8,"n_rows":139,"n_cols":17,"rows_kept":139,"cut":false,"hidden":false,"merged":[[0,1,1,2],[2,1,10,2]]}
[null,"Chart of Risks",{"$nulls":12},"Frequency","Severity","Impact"]
[{"$nulls":13},"Strategic",{"$f":"J35","v":3.2142857142857144},{"$f":"K35","v":3.4666666666666668},{"$f":"H35","v":15}]
[null,"This chart illustrates the aggregate frequency and severity of the risks associated with each different group of objectives. Each bubble's size increases with the number of risks identified for that set of objectives.",{"$nulls":11},"Financial",{"$f":"J52","v":3.3636363636363638},{"$f":"K52","v":2.9090909090909092},{"$f":"H52","v":11}]
[{"$nulls":13},"Compliance",{"$f":"J69","v":2.6666666666666665},{"$f":"K69","v":2.9333333333333331},{"$f":"H69","v":15}]
[{"$nulls":13},"Reputational",{"$f":"J86","v":2.7},{"$f":"K86","v":2.9},{"$f":"H86","v":10}]
[{"$nulls":13},"Operational",{"$f":"J103","v":3.6},{"$f":"K103","v":2.4},{"$f":"H103","v":15}]
{"$rows_left_out":107}
{"sheet":"Lists","index":9,"n_rows":57,"n_cols":17,"rows_kept":57,"cut":false,"hidden":false,"merged":[[35,6,50,9],[35,11,50,14],[35,16,54,16],[56,16,61,16]]}
["Location","ID"]
["UC Berkeley",1]
["UC San Francisco",2]
["UC Davis",3]
["UC Los Angeles",4]
["UC Riverside",5]
{"$rows_left_out":39}
{"sheet":"Scales","index":10,"n_rows":28,"n_cols":10,"rows_kept":28,"cut":false,"hidden":false,"merged":[[0,1,1,2],[2,4,2,5],[11,4,11,5],[20,4,20,5],[2,8,2,9]]}
[null,"Customize Scales",{"$nulls":4},"HIDE"]
[]
[{"$nulls":4},"Risk Impact",null,null,null,"Weighting"]
[{"$nulls":4},"Scale","Definition","Factor",null,"Risk Impact","Risk Likelihood"]
[{"$nulls":4},"Very high","Program operations are threatened or significantly affected in the immediate and long term",10,null,0.5,0.5]
[{"$nulls":4},"High","Program operations in the immediate term are significantly reduced or impacted, long term operations are potentially impaired.",8]
{"$rows_left_out":23}
{"sheet":"Scoring","index":11,"n_rows":25,"n_cols":11,"rows_kept":25,"cut":false,"hidden":false,"merged":[]}
[]
[null,"Severity Scales"]
[null,{"$f":"Scales!E5","v":"Very high"},null,null,null,"risk score","control"]
[null,{"$f":"Scales!E6","v":"High"},{"$nulls":4},{"$f":"B25","v":"None"},{"$f":"B24","v":"Minor"},{"$f":"B23","v":"Moderate"},{"$f":"B22","v":"Significant"},{"$f":"B21","v":"Nearly complete"}]
[null,{"$f":"Scales!E7","v":"Moderate"},null,null,null,2,"Adequately controlled","Adequately controlled","Potentially over-controlled","Potentially over-controlled","Potentially over-controlled"]
[null,{"$f":"Scales!E8","v":"Low"},null,null,null,{"$f":"F5+1","v":3},"Potentially poorly controlled","Adequately controlled","Potentially over-controlled","Potentially over-controlled","Potentially over-controlled"]
{"$rows_left_out":20}
{"sheet":"ForPrint","index":12,"n_rows":164,"n_cols":17,"rows_kept":164,"cut":false,"hidden":false,"merged":[[1,0,1,1]]}
[]
["Ratings and Summary"]
{"$rows_empty":10}
[null,null,null,{"$f":"Strategic!$D$5","v":"Strategic Risks"},"Management & Mitigation","Dashboards, Monitoring, & Accountability","Accountable Person/Department","Risk Rating"]
[null,null,null,{"$f":"IF(Strategic!$D$6=\"\",\"\",Strategic!$D$6)","v":"Budget impairment"},{"$f":"IF(Strategic!$G$6=\"\",\"\",Strategic!$G$6)","v":"External financing program; Budget Officers"},{"$f":"IF(Strategic!$J$6=\"\",\"\",Strategic!$J$6)","v":"Leveraging Wisdom & WISER systems"},{"$f":"IF(Strategic!$K$6=\"\",\"\",Strategic!$K$6)","v":"Senior leadership, Deans, Administration"},{"$f":"IF(Strategic!E6=\"\",\"\",IF(Strategic!F6=\"\",\"\",IF(Strategic!I6=\"\",\"\",INDEX(Scoring!$G$5:$K$13,MATCH(O14,Scoring!$F$5:$F$13,0),MATCH(P14,Scoring!$G$4:$K$4,0)))))","v":"Poorly controlled"},null,null,{"$f":"IF(Strategic!E6=\"\",\"\",IF(Strategic!F6=\"\",\"\",IF(Strategic!I6=\"\",\"\",(VLOOKUP(Strategic!E6,Scales!$E$5:$G$10,3,FALSE)))))","v":4},{"$f":"IF(K14=\"\",\"\",(VLOOKUP(Strategic!F6,Scales!$E$14:$G$19,3,FALSE)))","v":10},{"$f":"Scales!$I$5","v":0.5},{"$f":"Scales!$J$5","v":0.5},{"$f":"IF(K14=\"\",\"\",IF(L14=\"\",\"\",ROUND(SUMPRODUCT(K14:L14*M14:N14),0)))","v":7},{"$f":"Strategic!I6","v":"Minor"},{"$f":"IF(K14=\"\",\"\",IF(L14=\"\",\"\",IF(P14=\"\",\"\",K14*L14*(1-VLOOKUP(P14,Scales!$E$23:$G$27,3,FALSE)))))","v":30}]
[null,null,null,{"$f":"IF(Strategic!$D$7=\"\",\"\",Strategic!$D$7)","v":"Ineffective auxiliary management"},{"$f":"IF(Strategic!$G$7=\"\",\"\",Strategic!$G$7)","v":"Auxiliary departments have programs focused on operational excellence"},{"$f":"IF(Strategic!$J$7=\"\",\"\",Strategic!$J$7)","v":"Reported on department websites"},{"$f":"IF(Strategic!$K$7=\"\",\"\",Strategic!$K$7)","v":"Vice Chancellor of Student Affairs and CBO"},{"$f":"IF(Strategic!E7=\"\",\"\",IF(Strategic!F7=\"\",\"\",IF(Strategic!I7=\"\",\"\",INDEX(Scoring!$G$5:$K$13,MATCH(O15,Scoring!$F$5:$F$13,0),MATCH(P15,Scoring!$G$4:$K$4,0)))))","v":"Poorly controlled"},null,null,{"$f":"IF(Strategic!E7=\"\",\"\",IF(Strategic!F7=\"\",\"\",IF(Strategic!I7=\"\",\"\",(VLOOKUP(Strategic!E7,Scales!$E$5:$G$10,3,FALSE)))))","v":8},{"$f":"IF(K15=\"\",\"\",(VLOOKUP(Strategic!F7,Scales!$E$14:$G$19,3,FALSE)))","v":5},{"$f":"Scales!$I$5","v":0.5},{"$f":"Scales!$J$5","v":0.5},{"$f":"IF(K15=\"\",\"\",IF(L15=\"\",\"\",ROUND(SUMPRODUCT(K15:L15*M15:N15),0)))","v":7},{"$f":"Strategic!I7","v":"None"},{"$f":"IF(K15=\"\",\"\",IF(L15=\"\",\"\",IF(P15=\"\",\"\",K15*L15*(1-VLOOKUP(P15,Scales!$E$23:$G$27,3,FALSE)))))","v":40}]
{"$rows_left_out":99}
{"sheet":"Export","index":13,"n_rows":121,"n_cols":18,"rows_kept":121,"cut":false,"hidden":false,"merged":[]}
["UC Location ID","Department/College","Person1","Person2","Person3","Date","Risk Type","Objective","Risk","Likelihood","Severity","Management and Mitigation","Frequency of Controls","Control Effectiveness","Dashboards, Monitoring, & Reporting","Accountable\nPerson/Department","Rating","Residual"]
[{"$f":"IF(Intro!$F$10=\"\",\"\",VLOOKUP(Intro!$F$10,Lists!$A$1:$B$19,2,FALSE))","v":""},{"$f":"IF(Intro!$F$11=\"\",\"\",Intro!$F$11)","v":""},{"$f":"IF(Intro!$F$12=\"\",\"\",Intro!$F$12)","v":"John Doe"},{"$f":"IF(Intro!$F$13=\"\",\"\",Intro!$F$13)","v":"Jane Doe"},{"$f":"IF(Intro!$F$14=\"\",\"\",Intro!$F$14)","v":""},{"$f":"IF(Intro!$F$15=\"\",\"\",Intro!$F$15)","v":44867},{"$f":"IF(Intro!$F$5=\"\",\"\",\"Strategic\")","v":"Strategic"},{"$f":"IF(Objectives!F4=\"\",\"\",Objectives!F4)","v":"National and International Leader in in transforming educational experiences."}]
[{"$f":"IF(Intro!$F$10=\"\",\"\",VLOOKUP(Intro!$F$10,Lists!$A$1:$B$19,2,FALSE))","v":""},{"$f":"IF(Intro!$F$11=\"\",\"\",Intro!$F$11)","v":""},{"$f":"IF(Intro!$F$12=\"\",\"\",Intro!$F$12)","v":"John Doe"},{"$f":"IF(Intro!$F$13=\"\",\"\",Intro!$F$13)","v":"Jane Doe"},{"$f":"IF(Intro!$F$14=\"\",\"\",Intro!$F$14)","v":""},{"$f":"IF(Intro!$F$15=\"\",\"\",Intro!$F$15)","v":44867},{"$f":"IF(Intro!$F$5=\"\",\"\",\"Strategic\")","v":"Strategic"},{"$f":"IF(Objectives!F5=\"\",\"\",Objectives!F5)","v":"Recruit a larger and increasingly diverse student body."}]
[{"$f":"IF(Intro!$F$10=\"\",\"\",VLOOKUP(Intro!$F$10,Lists!$A$1:$B$19,2,FALSE))","v":""},{"$f":"IF(Intro!$F$11=\"\",\"\",Intro!$F$11)","v":""},{"$f":"IF(Intro!$F$12=\"\",\"\",Intro!$F$12)","v":"John Doe"},{"$f":"IF(Intro!$F$13=\"\",\"\",Intro!$F$13)","v":"Jane Doe"},{"$f":"IF(Intro!$F$14=\"\",\"\",Intro!$F$14)","v":""},{"$f":"IF(Intro!$F$15=\"\",\"\",Intro!$F$15)","v":44867},{"$f":"IF(Intro!$F$5=\"\",\"\",\"Strategic\")","v":"Strategic"},{"$f":"IF(Objectives!F6=\"\",\"\",Objectives!F6)","v":"Improve graduation success of all students."}]
[{"$f":"IF(Intro!$F$10=\"\",\"\",VLOOKUP(Intro!$F$10,Lists!$A$1:$B$19,2,FALSE))","v":""},{"$f":"IF(Intro!$F$11=\"\",\"\",Intro!$F$11)","v":""},{"$f":"IF(Intro!$F$12=\"\",\"\",Intro!$F$12)","v":"John Doe"},{"$f":"IF(Intro!$F$13=\"\",\"\",Intro!$F$13)","v":"Jane Doe"},{"$f":"IF(Intro!$F$14=\"\",\"\",Intro!$F$14)","v":""},{"$f":"IF(Intro!$F$15=\"\",\"\",Intro!$F$15)","v":44867},{"$f":"IF(Intro!$F$5=\"\",\"\",\"Strategic\")","v":"Strategic"},{"$f":"IF(Objectives!F7=\"\",\"\",Objectives!F7)","v":"Recruit, Retain, and Support talented and diverse faculty."}]
[{"$f":"IF(Intro!$F$10=\"\",\"\",VLOOKUP(Intro!$F$10,Lists!$A$1:$B$19,2,FALSE))","v":""},{"$f":"IF(Intro!$F$11=\"\",\"\",Intro!$F$11)","v":""},{"$f":"IF(Intro!$F$12=\"\",\"\",Intro!$F$12)","v":"John Doe"},{"$f":"IF(Intro!$F$13=\"\",\"\",Intro!$F$13)","v":"Jane Doe"},{"$f":"IF(Intro!$F$14=\"\",\"\",Intro!$F$14)","v":""},{"$f":"IF(Intro!$F$15=\"\",\"\",Intro!$F$15)","v":44867},{"$f":"IF(Intro!$F$5=\"\",\"\",\"Strategic\")","v":"Strategic"},{"$f":"IF(Objectives!F8=\"\",\"\",Objectives!F8)","v":""}]
{"$rows_left_out":115}